{"text_format":"1","workbook":"xlsx","n_sheets":25,"sheets":["Bygg 1","Bygg 2","Bygg 3","Bygg 4","Bygg 5","Bygg 6","Bygg 7","Bygg 8","Takst 1","Takst 2","Takst 3","Takst 4","Takst 5","Takst 6","Takst 7","Takst 8","SUM pr bygg","Priser innredning o.l.","Faktorer_bolig","Faktorer_andre","Priser innredning","Priser nybygg","Nedskriving","Service","Registreringsskjema"],"not_rendered":{"charts":2,"images":9,"macros":1,"external_links":0,"defined_names":136,"comments":10,"pivot_tables":0},"unopened":[],"bounds":{"document_bytes":16777216,"sheet_cells":100000,"rows_first":2000,"rows_last":500,"rows_between":2000,"halvings":0,"cell_chars":16384,"cell_head_chars":4096},"cells_cut":0,"cells_raw":0,"read":"whole","date_system":"1900"}

{"sheet":"Bygg 1","index":0,"n_rows":95,"n_cols":260,"rows_kept":95,"cut":false,"hidden":false,"merged":[[31,4,31,8],[2,7,2,8],[3,7,3,8],[29,4,29,8],[30,4,30,8]]}
["X"]
[null,null,null,"Byggeår;",0,"Oppr grunnflate;",0,null,"Befaring år;",{"$f":"YEAR(TODAY())","v":2022}]
[null,null,"Tilbygg;","År;",0,"Grunnflate tilbygg;",0]
[null,null,"Ombygd ","År;",0,null,null,"Korrigert pga oppgradering;",null,0]
[null,null,null,null,null,null,null,null,null,"tak max 10 %"]
[]
{"$rows_left_out":90}
{"sheet":"Bygg 2","index":1,"n_rows":93,"n_cols":260,"rows_kept":93,"cut":false,"hidden":false,"merged":[[3,7,3,8],[43,0,43,10],[29,4,29,8],[30,4,30,8],[31,4,31,8]]}
["X"]
[null,null,null,"Byggeår;",0,"Grunnflate;",0,null,"Befaring år;",{"$f":"YEAR(TODAY())","v":2022}]
[null,null,"Tilbygg;","År;",0,null,0]
[null,null,"Ombygd ","År;",0,null,null,"Korrigert pga oppgradering;",null,0]
[null,null,null,null,null,null,null,null,null,"tak max 10 %"]
[]
{"$rows_left_out":88}
{"sheet":"Bygg 3","index":2,"n_rows":93,"n_cols":260,"rows_kept":93,"cut":false,"hidden":false,"merged":[[3,7,3,8],[43,0,43,10],[29,4,29,8],[30,4,30,8],[31,4,31,8]]}
["X",0]
[null,null,null,"Byggeår;",0,"Grunnflate;",0,null,"Befaring år;",0]
[null,null,"Tilbygg;","År;",0,"Grunnflate;",0]
[null,null,"Ombygd ","År;",0,null,null,"Korrigert pga oppgradering;",null,0]
[null,null,null,null,null,null,null,null,null,"tak max 10 %"]
[]
{"$rows_left_out":88}
{"sheet":"Bygg 4","index":3,"n_rows":90,"n_cols":260,"rows_kept":90,"cut":false,"hidden":false,"merged":[[3,7,3,8],[43,0,43,10],[29,4,29,8],[30,4,30,8],[31,4,31,8]]}
["X",0]
[null,null,null,"Byggeår;",0,"Grunnflate;",0,null,"Befaring år;",0]
[null,null,"Tilbygg;","År;",0,"Grunnflate;",0]
[null,null,"Ombygd ","År;",0,null,null,"Korrigert pga oppgradering;",null,0]
[null,null,null,null,null,null,null,null,null,"tak max 10 %"]
[]
{"$rows_left_out":85}
{"sheet":"Bygg 5","index":4,"n_rows":91,"n_cols":260,"rows_kept":91,"cut":false,"hidden":false,"merged":[[3,7,3,8],[43,0,43,10],[29,4,29,8],[30,4,30,8],[31,4,31,8]]}
["X",0]
[null,null,null,"Byggeår;",0,"Grunnflate;",0,null,"Befaring år;",{"$f":"YEAR(TODAY())","v":2022}]
[null,null,"Tilbygg;","År;",0,"Grunnflate;",0]
[null,null,"Ombygd ","År;",0,null,null,"Korrigert pga oppgradering;",null,0]
[null,null,null,null,null,null,null,null,null,"tak max 10 %"]
[]
{"$rows_left_out":86}
{"sheet":"Bygg 6","index":5,"n_rows":91,"n_cols":260,"rows_kept":91,"cut":false,"hidden":false,"merged":[[3,7,3,8],[43,0,43,10],[29,4,29,8],[30,4,30,8],[31,4,31,8]]}
["X",0]
[null,null,null,"Byggeår;",0,"Grunnflate;",0,null,"Befaring år;",{"$f":"YEAR(TODAY())","v":2022}]
[null,null,"Tilbygg;","År;",0,"Grunnflate;",0]
[null,null,"Ombygd ","År;",0,null,null,"Korrigert pga oppgradering;",null,0]
[null,null,null,null,null,null,null,null,null,"tak max 10 %"]
[]
{"$rows_left_out":86}
{"sheet":"Bygg 7","index":6,"n_rows":91,"n_cols":260,"rows_kept":91,"cut":false,"hidden":false,"merged":[[3,7,3,8],[43,0,43,10],[29,4,29,8],[30,4,30,8],[31,4,31,8]]}
["X",0]
[null,null,null,"Byggeår;",0,"Grunnflate;",0,null,"Befaring år;",{"$f":"YEAR(TODAY())","v":2022}]
[null,null,"Tilbygg;","År;",0,"Grunnflate;",0]
[null,null,"Ombygd ","År;",0,null,null,"Korrigert pga oppgradering;",null,0]
[null,null,null,null,null,null,null,null,null,"tak max 10 %"]
[]
{"$rows_left_out":86}
{"sheet":"Bygg 8","index":7,"n_rows":91,"n_cols":260,"rows_kept":91,"cut":false,"hidden":false,"merged":[[3,7,3,8],[43,0,43,10],[29,4,29,8],[30,4,30,8],[31,4,31,8]]}
["X",0]
[null,null,null,"Byggeår;",0,"Grunnflate;",0,null,"Befaring år;",{"$f":"YEAR(TODAY())","v":2022}]
[null,null,"Tilbygg;","År;",0,"Grunnflate;",0]
[null,null,"Ombygd ","År;",0,null,null,"Korrigert pga oppgradering;",null,0]
[null,null,null,null,null,null,null,null,null,"tak max 10 %"]
[]
{"$rows_left_out":86}
{"sheet":"Takst 1","index":8,"n_rows":29,"n_cols":15,"rows_kept":29,"cut":false,"hidden":false,"merged":[]}
[null,{"$f":"'Bygg 1'!A1","v":"X"},null,null,null,null,null,null,"Tillegg for spesielle konstruksjoner / påkostninger"]
[null,null,null,null,null,null,null,null,"Nr",null,"Beskrivelse",null,null,null,"Beløp"]
[null,null,null,null,"Pris pr m2/BTA etter byggtype",{"$f":"('Bygg 1'!B8*'Bygg 1'!L49+'Bygg 1'!B11*'Bygg 1'!L52+'Bygg 1'!B14*'Bygg 1'!L55+'Bygg 1'!B17*'Bygg 1'!L58+'Bygg 1'!B20*'Bygg 1'!L61+'Bygg 1'!B23*'Bygg 1'!L64)/('Bygg 1'!B8+'Bygg 1'!B11+'Bygg 1'!B14+'Bygg 1'!B17+'Bygg 1'!B20+'Bygg 1'!B23)*'Bygg 1'!L67/100","v":{"$error":"#DIV/0!"}},null,null,1,null,"Kostnad ved opparbeidelse av tomt, avløp, vann",null,null,null,{"$f":"'Bygg 1'!L74","v":0}]
[null,null,null,null,"Korreksjon for størrelse i prosent",{"$f":"'Bygg 1'!L70/100","v":1},"Kr",null,2,null,"Korntørke"]
[null,null,null,null,"Justert pris pr m2",{"$f":"F3*F4","v":{"$error":"#DIV/0!"}},"Kr",null,3,null,"Teknisk utstyr"]
[null,null,null,null,null,null,null,null,4,null,"Verksted"]
{"$rows_left_out":24}
{"sheet":"Takst 2","index":9,"n_rows":29,"n_cols":15,"rows_kept":29,"cut":false,"hidden":false,"merged":[]}
[null,{"$f":"'Bygg 2'!A1","v":"X"},null,null,null,null,null,null,"Tillegg for spesielle konstruksjoner / påkostninger"]
[null,null,null,null,null,null,null,null,"Nr",null,"Beskrivelse",null,null,null,"Beløp"]
[null,null,null,null,"Pris pr m2/BTA etter byggtype",{"$f":"('Bygg 2'!B8*'Bygg 2'!L49+'Bygg 2'!B11*'Bygg 2'!L52+'Bygg 2'!B14*'Bygg 2'!L55+'Bygg 2'!B17*'Bygg 2'!L58+'Bygg 2'!B20*'Bygg 2'!L61+'Bygg 2'!B23*'Bygg 2'!L64)/('Bygg 2'!B8+'Bygg 2'!B11+'Bygg 2'!B14+'Bygg 2'!B17+'Bygg 2'!B20+'Bygg 2'!B23)*'Bygg 2'!L67/100","v":{"$error":"#DIV/0!"}},null,null,1,null,"Kostnad ved opparbeidelse av tomt, avløp, vann",null,null,null,{"$f":"'Bygg 2'!L74","v":0}]
[null,null,null,null,"Korreksjon for størrelse i prosent",{"$f":"'Bygg 2'!L70/100","v":1},"Kr",null,2,null,"Korntørke"]
[null,null,null,null,"Justert pris pr m2",{"$f":"F3*F4","v":{"$error":"#DIV/0!"}},"Kr",null,3,null,"Teknisk utstyr"]
[null,null,null,null,null,null,null,null,4,null,"Verksted"]
{"$rows_left_out":24}
{"sheet":"Takst 3","index":10,"n_rows":29,"n_cols":15,"rows_kept":29,"cut":false,"hidden":false,"merged":[]}
[{"$f":"'Bygg 3'!A1","v":"X"},null,null,null,null,null,null,null,"Tillegg for spesielle konstruksjoner / påkostninger"]
[null,null,null,null,null,null,null,null,"Nr",null,"Beskrivelse"]
[null,null,null,null,"Pris pr m2/BTA etter byggtype",{"$f":"('Bygg 3'!B8*'Bygg 3'!L49+'Bygg 3'!B11*'Bygg 3'!L52+'Bygg 3'!B14*'Bygg 3'!L55+'Bygg 3'!B17*'Bygg 3'!L58+'Bygg 3'!B20*'Bygg 3'!L61+'Bygg 3'!B23*'Bygg 3'!L64)/('Bygg 3'!B8+'Bygg 3'!B11+'Bygg 3'!B14+'Bygg 3'!B17+'Bygg 3'!B20+'Bygg 3'!B23)*'Bygg 3'!L67/100","v":{"$error":"#DIV/0!"}},"Kr",null,1,null,"Kostnad ved opparbeidelse av tomt, avløp, vann",null,null,null,{"$f":"'Bygg 3'!T58","v":0}]
[null,null,null,null,"Korreksjon for størrelse i prosent",{"$f":"'Bygg 3'!L70/100","v":1},null,null,2,null,"Korntørke"]
[null,null,null,null,"Justert pris pr m2",{"$f":"F3*F4","v":{"$error":"#DIV/0!"}},"Kr",null,3,null,"Teknisk utstyr"]
[null,null,null,null,null,null,null,null,4,null,"Verksted"]
{"$rows_left_out":24}
{"sheet":"Takst 4","index":11,"n_rows":29,"n_cols":15,"rows_kept":29,"cut":false,"hidden":false,"merged":[]}
[{"$f":"'Bygg 4'!A1","v":"X"},null,null,null,null,null,null,null,"Tillegg for spesielle konstruksjoner / påkostninger"]
[null,null,null,null,null,null,null,null,"Nr",null,"Beskrivelse"]
[null,null,null,null,"Pris pr m2/BTA etter byggtype",{"$f":"('Bygg 4'!B8*'Bygg 4'!L49+'Bygg 4'!B11*'Bygg 4'!L52+'Bygg 4'!B14*'Bygg 4'!L55+'Bygg 4'!B17*'Bygg 4'!L58+'Bygg 4'!B20*'Bygg 4'!L61+'Bygg 4'!B23*'Bygg 4'!L64)/('Bygg 4'!B8+'Bygg 4'!B11+'Bygg 4'!B14+'Bygg 4'!B17+'Bygg 4'!B20+'Bygg 4'!B23)*'Bygg 4'!L67/100","v":{"$error":"#DIV/0!"}},"Kr",null,1,null,"Kostnad ved opparbeidelse av tomt, avløp, vann",null,null,null,{"$f":"'Bygg 4'!T58","v":0}]
[null,null,null,null,"Korreksjon for størrelse i prosent",{"$f":"'Bygg 4'!L70/100","v":1},null,null,2,null,"Korntørke"]
[null,null,null,null,"Justert pris pr m2",{"$f":"F3*F4","v":{"$error":"#DIV/0!"}},"Kr",null,3,null,"Teknisk utstyr"]
[null,null,null,null,null,null,null,null,4,null,"Verksted"]
{"$rows_left_out":24}
{"sheet":"Takst 5","index":12,"n_rows":29,"n_cols":15,"rows_kept":29,"cut":false,"hidden":false,"merged":[]}
[{"$f":"'Bygg 5'!A1","v":"X"},null,null,null,null,null,null,null,"Tillegg for spesielle konstruksjoner / påkostninger"]
[null,null,null,null,null,null,null,null,"Nr",null,"Beskrivelse"]
[null,null,null,null,"Pris pr m2/BTA etter byggtype",{"$f":"('Bygg 5'!B8*'Bygg 5'!L49+'Bygg 5'!B11*'Bygg 5'!L52+'Bygg 5'!B14*'Bygg 5'!L55+'Bygg 5'!B17*'Bygg 5'!L58+'Bygg 5'!B20*'Bygg 5'!L61+'Bygg 5'!B23*'Bygg 5'!L64)/('Bygg 5'!B8+'Bygg 5'!B11+'Bygg 5'!B14+'Bygg 5'!B17+'Bygg 5'!B20+'Bygg 5'!B23)*'Bygg 5'!L67/100","v":{"$error":"#DIV/0!"}},"Kr",null,1,null,"Kostnad ved opparbeidelse av tomt, avløp, vann",null,null,null,{"$f":"'Bygg 5'!T58","v":0}]
[null,null,null,null,"Korreksjon for størrelse i prosent",{"$f":"'Bygg 5'!L70/100","v":1},null,null,2,null,"Korntørke"]
[null,null,null,null,"Justert pris pr m2",{"$f":"F3*F4","v":{"$error":"#DIV/0!"}},"Kr",null,3,null,"Teknisk utstyr"]
[null,null,null,null,null,null,null,null,4,null,"Verksted"]
{"$rows_left_out":24}
{"sheet":"Takst 6","index":13,"n_rows":29,"n_cols":15,"rows_kept":29,"cut":false,"hidden":false,"merged":[]}
[{"$f":"'Bygg 6'!A1","v":"X"},null,null,null,null,null,null,null,"Tillegg for spesielle konstruksjoner / påkostninger"]
[null,null,null,null,null,null,null,null,"Nr",null,"Beskrivelse"]
[null,null,null,null,"Pris pr m2/BTA etter byggtype",{"$f":"('Bygg 6'!B8*'Bygg 6'!L49+'Bygg 6'!B11*'Bygg 6'!L52+'Bygg 6'!B14*'Bygg 6'!L55+'Bygg 6'!B17*'Bygg 6'!L58+'Bygg 6'!B20*'Bygg 6'!L61+'Bygg 6'!B23*'Bygg 6'!L64)/('Bygg 6'!B8+'Bygg 6'!B11+'Bygg 6'!B14+'Bygg 6'!B17+'Bygg 6'!B20+'Bygg 6'!B23)*'Bygg 6'!L67/100","v":{"$error":"#DIV/0!"}},"Kr",null,1,null,"Kostnad ved opparbeidelse av tomt, avløp, vann",null,null,null,{"$f":"'Bygg 6'!T58","v":0}]
[null,null,null,null,"Korreksjon for størrelse i prosent",{"$f":"'Bygg 6'!L70/100","v":1},null,null,2,null,"Korntørke"]
[null,null,null,null,"Justert pris pr m2",{"$f":"F3*F4","v":{"$error":"#DIV/0!"}},"Kr",null,3,null,"Teknisk utstyr"]
[null,null,null,null,null,null,null,null,4,null,"Verksted"]
{"$rows_left_out":24}
{"sheet":"Takst 7","index":14,"n_rows":29,"n_cols":15,"rows_kept":29,"cut":false,"hidden":false,"merged":[]}
[{"$f":"'Bygg 7'!A1","v":"X"},null,null,null,null,null,null,null,"Tillegg for spesielle konstruksjoner / påkostninger"]
[null,null,null,null,null,null,null,null,"Nr",null,"Beskrivelse"]
[null,null,null,null,"Pris pr m2/BTA etter byggtype",{"$f":"('Bygg 7'!B8*'Bygg 7'!L49+'Bygg 7'!B11*'Bygg 7'!L52+'Bygg 7'!B14*'Bygg 7'!L55+'Bygg 7'!B17*'Bygg 7'!L58+'Bygg 7'!B20*'Bygg 7'!L61+'Bygg 7'!B23*'Bygg 7'!L64)/('Bygg 7'!B8+'Bygg 7'!B11+'Bygg 7'!B14+'Bygg 7'!B17+'Bygg 7'!B20+'Bygg 7'!B23)*'Bygg 7'!L67/100","v":{"$error":"#DIV/0!"}},"Kr",null,1,null,"Kostnad ved opparbeidelse av tomt, avløp, vann",null,null,null,{"$f":"'Bygg 7'!T58","v":0}]
[null,null,null,null,"Korreksjon for størrelse i prosent",{"$f":"'Bygg 7'!L70/100","v":1},null,null,2,null,"Korntørke"]
[null,null,null,null,"Justert pris pr m2",{"$f":"F3*F4","v":{"$error":"#DIV/0!"}},"Kr",null,3,null,"Teknisk utstyr"]
[null,null,null,null,null,null,null,null,4,null,"Verksted"]
{"$rows_left_out":24}
{"sheet":"Takst 8","index":15,"n_rows":29,"n_cols":15,"rows_kept":29,"cut":false,"hidden":false,"merged":[]}
[{"$f":"'Bygg 8'!A1","v":"X"},null,null,null,null,null,null,null,"Tillegg for spesielle konstruksjoner / påkostninger"]
[null,null,null,null,null,null,null,null,"Nr",null,"Beskrivelse"]
[null,null,null,null,"Pris pr m2/BTA etter byggtype",{"$f":"('Bygg 8'!B8*'Bygg 8'!L49+'Bygg 8'!B11*'Bygg 8'!L52+'Bygg 8'!B14*'Bygg 8'!L55+'Bygg 8'!B17*'Bygg 8'!L58+'Bygg 8'!B20*'Bygg 8'!L61+'Bygg 8'!B23*'Bygg 8'!L64)/('Bygg 8'!B8+'Bygg 8'!B11+'Bygg 8'!B14+'Bygg 8'!B17+'Bygg 8'!B20+'Bygg 8'!B23)*'Bygg 8'!L67/100","v":{"$error":"#DIV/0!"}},"Kr",null,1,null,"Kostnad ved opparbeidelse av tomt, avløp, vann",null,null,null,{"$f":"'Bygg 8'!T58","v":0}]
[null,null,null,null,"Korreksjon for størrelse i prosent",{"$f":"'Bygg 8'!L70/100","v":1},null,null,2,null,"Korntørke"]
[null,null,null,null,"Justert pris pr m2",{"$f":"F3*F4","v":{"$error":"#DIV/0!"}},"Kr",null,3,null,"Teknisk utstyr"]
[null,null,null,null,null,null,null,null,4,null,"Verksted"]
{"$rows_left_out":24}
{"sheet":"SUM pr bygg","index":16,"n_rows":11,"n_cols":18,"rows_kept":11,"cut":false,"hidden":false,"merged":[]}
[null,null,null,"Hus nr","Navn","type","Beregn.verdi","BTA","Byggeår","Alder","Nypris",null,"Korreksjon","Endelig verdi","Verdi/BTA","% restverdi","Ant. dyr/tonn","Pris/enhet"]
[null,null,null,1,{"$f":"'Bygg 1'!A1","v":"X"},{"$f":"'Takst 1'!F$1","v":0},{"$f":"IF(ISERROR('Takst 1'!$J$27),0,'Takst 1'!$J$27)","v":0},{"$f":"areal_k+areal_u+areal_1+areal_2+'Bygg 1'!$B$20","v":0},{"$f":"'Bygg 1'!$E$2","v":0},{"$f":"YEAR(TODAY())-I2","v":2022},{"$f":"'Bygg 1'!$L$67","v":0},null,1,{"$f":"G2*M2","v":0},{"$f":"N2/(H2+0.000001)","v":0},{"$f":"O2/K2","v":{"$error":"#DIV/0!"}},null,{"$f":"IF(Q2>0,N2/Q2,\"\")","v":""}]
[null,null,null,2,{"$f":"'Bygg 2'!A1","v":"X"},{"$f":"'Takst 2'!B$1","v":"X"},{"$f":"IF(ISERROR('Takst 2'!$J$27),0,'Takst 2'!$J$27)","v":0},{"$f":"'Bygg 2'!areal_k+'Bygg 2'!areal_u+'Bygg 2'!areal_1+'Bygg 2'!areal_2+'Bygg 2'!$B$20","v":0},{"$f":"'Bygg 2'!$E$2","v":0},{"$f":"IF(G3=0,0,YEAR(TODAY())-I3)","v":0},{"$f":"'Bygg 2'!$L$67","v":0},null,1,0,{"$f":"N3/(H3+0.000001)","v":0},{"$f":"O3/K3","v":{"$error":"#DIV/0!"}},null,""]
[null,null,null,3,{"$f":"'Bygg 3'!$A$1","v":"X"},{"$f":"'Takst 3'!A$1","v":"X"},{"$f":"IF(ISERROR('Takst 3'!$J$27),0,'Takst 3'!$J$27)","v":0},{"$f":"'Bygg 3'!areal_k+'Bygg 3'!areal_u+'Bygg 3'!areal_1+'Bygg 3'!areal_2+'Bygg 3'!$B$20","v":0},{"$f":"'Bygg 3'!$E$2","v":0},{"$f":"IF(G4=0,0,YEAR(TODAY())-I4)","v":0},{"$f":"'Bygg 3'!$L$67","v":0},null,1,0,0,{"$error":"#DIV/0!"},null,""]
[null,null,null,4,{"$f":"'Bygg 4'!$A$1","v":"X"},{"$f":"'Takst 4'!A$1","v":"X"},{"$f":"IF(ISERROR('Takst 4'!$J$27),0,'Takst 4'!$J$27)","v":0},{"$f":"'Bygg 4'!areal_k+'Bygg 4'!areal_u+'Bygg 4'!areal_1+'Bygg 4'!areal_2+'Bygg 4'!$B$20","v":0},{"$f":"'Bygg 4'!$E$2","v":0},0,{"$f":"'Bygg 4'!$L$67","v":0},null,1,0,0,{"$error":"#DIV/0!"},70,0]
[null,null,null,5,{"$f":"'Bygg 5'!$A$1","v":"X"},{"$f":"'Takst 5'!A$1","v":"X"},{"$f":"IF(ISERROR('Takst 5'!$J$27),0,'Takst 5'!$J$27)","v":0},{"$f":"'Bygg 5'!areal_k+'Bygg 5'!areal_u+'Bygg 5'!areal_1+'Bygg 5'!areal_2+'Bygg 5'!$B$20","v":0},{"$f":"'Bygg 5'!$E$2","v":0},0,{"$f":"'Bygg 5'!$L$67","v":0},null,1,0,0,{"$error":"#DIV/0!"},null,""]
{"$rows_left_out":6}
{"sheet":"Priser innredning o.l.","index":17,"n_rows":46,"n_cols":4,"rows_kept":46,"cut":false,"hidden":false,"merged":[]}
[null,"Enhetspriser for innredninger og utstyr"]
[]
[null,{"$f":"'Priser innredning'!A3","v":"Teknisk utstyr:"},{"$f":"'Priser innredning'!B3","v":"Isolert verksted m/innl.vann/isolert port, pr kvm"},{"$f":"'Priser innredning'!C3","v":5860}]
[null,null,{"$f":"'Priser innredning'!B4","v":"Universaltørke, pris pr kvm inkl. hovedkanal"},{"$f":"'Priser innredning'!C4","v":3280}]
[null,null,{"$f":"'Priser innredning'!B5","v":"Universaltørke, pr tonn ved 1,5 m tørkehøyde"},{"$f":"'Priser innredning'!C5","v":7872}]
[null,null,{"$f":"'Priser innredning'!B6","v":"Ventilert potet/grønnsak-lager, pr kbm (4m lagerhøyde)"},{"$f":"'Priser innredning'!C6","v":2167}]
{"$rows_left_out":41}
{"sheet":"Faktorer_bolig","index":18,"n_rows":21,"n_cols":17,"rows_kept":21,"cut":false,"hidden":false,"merged":[[3,0,5,0],[6,0,8,0],[9,0,11,0],[12,0,14,0]]}
[]
[null,null,"Faktorer brukt ved verdiberegning av bolighus",null,null,null,null,null,null,null,null,null,"Korreksjon for stort areal"]
[null,null,null,null,null,null,null,null,null,null,null,null,null,"Kjeller","undertasje","1 etg","2.etg"]
[{"$f":"Registreringsskjema!A9","v":"Kjeller:"},{"$f":"Registreringsskjema!B9","v":"Arealbruk i %;"},{"$f":"Registreringsskjema!C9","v":"lager/uinnr."},0.1,{"$f":"Registreringsskjema!E9","v":"enkel brukskjeller"},0.25,{"$f":"Registreringsskjema!G9","v":"vanlig kjeller"},0.4,null,null,null,null,"faktorer:",{"$f":"H4","v":0.4},{"$f":"H7","v":0.7},{"$f":"H10","v":1},{"$f":"H13","v":0.6}]
[null,{"$f":"Registreringsskjema!B10","v":"Etasjestd i %;"},{"$f":"Registreringsskjema!C10","v":"svak/gråstein"},0.56000000000000005,{"$f":"Registreringsskjema!E10","v":"enkel lagerkjeller"},0.75,{"$f":"Registreringsskjema!G10","v":"bra kjeller"},0.87,{"$f":"Registreringsskjema!I10","v":"god kjellerstd."},1]
[null,{"$f":"Registreringsskjema!B11","v":"Tilst/egnethet;"},{"$f":"Registreringsskjema!C11","v":"slitt/dårl"},0.56000000000000005,{"$f":"Registreringsskjema!E11","v":"brukbar"},0.75,{"$f":"Registreringsskjema!G11","v":"god"},0.87,{"$f":"Registreringsskjema!I11","v":"sv. god"},1]
{"$rows_left_out":16}
{"sheet":"Faktorer_andre","index":19,"n_rows":18,"n_cols":17,"rows_kept":18,"cut":false,"hidden":false,"merged":[[3,0,5,0],[6,0,8,0],[9,0,11,0],[12,0,14,0],[15,0,17,0]]}
[]
[null,"Faktorer brukt ved verdiberegning av andre bygg enn bolig",null,null,null,null,null,null,null,null,null,"Korreksjon for stort areal"]
[null,null,null,null,null,null,null,null,null,null,null,null,"Kjeller","undertasje","1 etg","2.etg","mesanin"]
[{"$f":"Registreringsskjema!A37","v":"Kjeller:"},{"$f":"Registreringsskjema!B37","v":"Arealbruk i %;"},{"$f":"Registreringsskjema!C37","v":"svak/uinnr."},0.1,{"$f":"Registreringsskjema!E37","v":"enkel lagerkjeller"},0.2,{"$f":"Registreringsskjema!G37","v":"vanl. bruksareal"},0.3,null,null,null,"faktorer:",{"$f":"H4","v":0.3},{"$f":"H7","v":0.5},{"$f":"H10","v":1},{"$f":"H13","v":0.6},{"$f":"H16","v":0.3}]
[null,{"$f":"Registreringsskjema!B38","v":"Etasjestd i %;"},{"$f":"Registreringsskjema!C38","v":"svak/gråstein"},0.4,{"$f":"Registreringsskjema!E38","v":"enkelt lager"},0.6,{"$f":"Registreringsskjema!G38","v":"bra lagerareal"},0.8,{"$f":"Registreringsskjema!I38","v":"godt bruksareal"},1]
[null,{"$f":"Registreringsskjema!B39","v":"Tilst/egnethet;"},{"$f":"Registreringsskjema!C39","v":"slitt/dårlig"},0.4,{"$f":"Registreringsskjema!E39","v":"brukbar"},0.6,{"$f":"Registreringsskjema!G39","v":"bra"},0.8,{"$f":"Registreringsskjema!I39","v":"svært god"},1]
{"$rows_left_out":13}
{"sheet":"Priser innredning","index":20,"n_rows":46,"n_cols":3,"rows_kept":46,"cut":false,"hidden":false,"merged":[]}
["Enhetspriser for innredninger og utstyr"]
[]
["Teknisk utstyr:","Isolert verksted m/innl.vann/isolert port, pr kvm",5860]
[null,"Universaltørke, pris pr kvm inkl. hovedkanal",3280]
[null,"Universaltørke, pr tonn ved 1,5 m tørkehøyde",7872]
[null,"Ventilert potet/grønnsak-lager, pr kbm (4m lagerhøyde)",2167]
{"$rows_left_out":41}
{"sheet":"Priser nybygg","index":21,"n_rows":38,"n_cols":8,"rows_kept":38,"cut":false,"hidden":false,"merged":[[0,0,0,1]]}
["Priser nytt bygg",null,2,3,4,5,6]
["Sortering","Hustype","pris pr m2","Faktorer_valgt","Valgt avskrivningskurve",null,"Tomt ?"]
[14,"And/kalkun, gml konsesjonsgrense",6120,2,3,{"$f":"HLOOKUP(E3,Nedskriving!$E$1:$G$2,2)","v":"Husdyrbygg"},null,"På denne siden kan vi legge inn nye byggtyper og redigere gamle. Hvis du endrer kolonne 1 = Hustype bør du sortere"]
[3,"Bo, bryggerhus",21350,1,1,{"$f":"HLOOKUP(E4,Nedskriving!$E$1:$G$2,2)","v":"Bolig"},null,"tabellen etterpå ved å trykke på knappen over. "]
[2,"Bo, kårbolig",28420,1,1,{"$f":"HLOOKUP(E5,Nedskriving!$E$1:$G$2,2)","v":"Bolig"}]
[1,"Bo, våningshus",33000,1,1,{"$f":"HLOOKUP(E6,Nedskriving!$E$1:$G$2,2)","v":"Bolig"},1]
{"$rows_left_out":33}
{"sheet":"Nedskriving","index":22,"n_rows":400,"n_cols":12,"rows_kept":400,"cut":false,"hidden":false,"merged":[]}
["ÅR",60,40,25,1,2,3,null,null,1,2,3]
[null,"Bolig","Låve","Kyllinghus","Bolig","Uthus","Husdyrbygg",null,null,"Bolig","Uthus","Husdyrbygg"]
["Faktor",1.4124293785311215E-2,1.282051282051278E-2,-1.3964523981613297E-16,100,100,100,null,"Nedskrivningssats pr år",0.6,1.5,2.25]
[1,1.25,{"$f":"100/C1-1","v":1.5},{"$f":"100/D1-2","v":2},{"$f":"MAX(E3-J$3,J$4)","v":99.4},{"$f":"MAX(F3-K$3,K$4)","v":98.5},{"$f":"MAX(G3-L$3,L$4)","v":97.75},null,"Min restverdi i %",40,30,20]
[2,{"$f":"B4-B$3","v":1.2358757062146888},{"$f":"MAX(C4-C$3,0)","v":1.4871794871794872},{"$f":"MAX(D4-D$3,0)","v":2},{"$f":"MAX(E4-J$3,J$4)","v":98.800000000000011},{"$f":"MAX(F4-K$3,K$4)","v":97},95.5]
[{"$f":"A5+1","v":3},{"$f":"B5-$B$3","v":1.2217514124293776},{"$f":"MAX(C5-C$3,0)","v":1.4743589743589745},{"$f":"MAX(D5-D$3,0)","v":2},98.200000000000017,95.5,93.25]
{"$rows_left_out":395}
{"sheet":"Service","index":23,"n_rows":30,"n_cols":6,"rows_kept":30,"cut":false,"hidden":false,"merged":[]}
["Se"]
[]
[]
[null,null,null,null,"Ark som skal skjules"]
[null,null,null,null,"Faktorer_bolig"]
[null,null,null,null,"Faktorer_andre"]
{"$rows_left_out":25}
{"sheet":"Registreringsskjema","index":24,"n_rows":51,"n_cols":13,"rows_kept":51,"cut":false,"hidden":false,"merged":[[23,2,23,7],[22,2,22,7],[3,6,3,7],[2,4,2,5],[2,6,2,7],[2,2,2,3],[20,0,20,9],[21,2,21,7],[11,8,11,9],[14,8,14,9],[17,8,17,9],[21,9,23,9],[22,0,23,0],[0,0,0,9],[1,0,1,9],[2,0,4,0],[7,0,7,9],[8,8,8,9],[3,2,3,3],[5,0,5,9],[6,0,6,9],[2,8,2,9],[3,4,3,5],[45,8,45,9],[48,8,48,9],[42,8,42,9],[24,2,24,7],[32,0,32,9],[33,0,35,0],[36,8,36,9],[39,8,39,9],[34,2,34,3],[34,4,34,5],[34,6,34,7],[33,2,33,3],[33,4,33,5],[33,6,33,7],[33,8,33,9]]}
["Registeringsskjema"]
["Bolighus",null,null,null,null,null,null,null,null,null,null,"Teksten i disse rubrikkene overføres til "]
["Generell info:","Byggeår;",null,null,"Grunnflate BTA  oppr. bygg;",null,null,null,null,null,null,null,"Faktorer_bolig"]
[null,"Tilbygg (alle)år;",null,null,"Grunnflate BTA (alle tilbygg.)",null,null,null,null,null,null,null,"Faktorer_andre"]
[null,"Ombygg år;",null,"innv. 0-40",null,"utv. 0-25",null,"tak 0-10"]
[]
{"$rows_left_out":45}